filosofie, religioni e storia dell'india e dell'asia centrale
type: Concept
broader: 018
definition: Comprende gli studi relativi al pensiero e alla religiosità dell'area indiana, dal periodo vedico all'età moderna, tanto in campo hinduista, quanto in quello dei movimenti soteriologici anti-brahmanici, jainismo e buddhismo, incluse le testimonianze nel Sud-est asiatico e nell'area tibeto-cinese, studi che impiegano metodologie filologiche, per i testi in lingua originale, e antropologico-etnologiche, per il quadro indiano contemporaneo. Il settore comprende pure gli studi sulla storia politica, istituzionale, sociale, economica e culturale dell'India, dell'Asia centrale e dell'Afghanistan, dalle prime formazioni statali all'età contemporanea.
editorial note: Fonte: Decreto Ministeriale 4 ottobre 2000 [In rete] http://attiministeriali.miur.it/anno-2000/ottobre/dm-04102000.aspx (26 febbraio 2018)
in scheme: subject-disciplines
notation: 018.017
preferred label: indian and central asian philosophy, religions and history @en
has rank order: 2