archeologia, storia dell'arte e filosofie dell'asia orientale
type: Concept
broader: 018
definition: Comprende gli studi relativi alla storia delle religioni, dei movimenti di pensiero e delle correnti artistiche sviluppatesi nell’area dell’Asia Orientale dall’antichità all’epoca moderna, condotti con l'impiego delle metodologie linguistica e filologica, con particolare riferimento alle lingue dell’area, e di quelle proprie dell’indagine archeologica, filologica, storica, antropologica, artistica e iconologica anche in rapporto alle principali culture che hanno influenzato le civiltà estremo-orientali.
editorial note: Fonte: Decreto Ministeriale 4 ottobre 2000 [In rete] http://attiministeriali.miur.it/anno-2000/ottobre/dm-04102000.aspx (26 febbraio 2018)
in scheme: subject-disciplines
notation: 018.020
preferred label: east asian archaeology, art history and philosophy @en
has rank order: 2