storia dell'asia orientale e sud-orientale
type: Concept
broader: https://w3id.org/italia/controlled-vocabulary/classifications-for-culture/subject-disciplines/018
notation: 018.023
editorial note: Fonte: Decreto Ministeriale 4 ottobre 2000 [In rete] http://attiministeriali.miur.it/anno-2000/ottobre/dm-04102000.aspx (26 febbraio 2018)
has rank order: 2
definition: Comprende gli studi storici sull'Asia orientale e sud-orientale, dall'antichità all'età contemporanea, fondati su fonti originali e condotti con strumenti e metodologie di ricerca adeguate alle differenze cronologiche e geografiche dei diversi ambiti di ricerca.
preferred label: history of east and south-east asia @en
in scheme: subject-disciplines