storia medievale
type: Concept
definition: Il settore comprende le ricerche che riguardano l'ampio arco cronologico che va dal secolo V al secolo XV e che si intrecciano, per contenuti e metodi, con la storia dell'antichità e dei tempi antico e moderno. Il settore è caratterizzato da interdisciplinarità e da un vasto ventaglio di istanze metodologiche che tengono conto della caratteristica connotazione europea e italiana, ma si aprono anche a una indagine sui diversi aspetti dell'espansione europea e quindi di contatto con le altre culture che hanno la loro origine proprio nell'età medievale. Include anche le competenze relative allo studio storico dei fenomeni politico-istituzionali, economico-sociali, religiosi, delle relazioni di genere, culturali, militari del periodo considerato. Comprende altresì gli studi relativi alla metodologia, alle fonti, alla storiografia e alla didattica del settore.
preferred label: medieval history @en
editorial note: Fonte: Decreto Ministeriale 4 ottobre 2000 [In rete] http://attiministeriali.miur.it/anno-2000/ottobre/dm-04102000.aspx (26 febbraio 2018)
broader: https://w3id.org/italia/controlled-vocabulary/classifications-for-culture/subject-disciplines/019
related match: http://thes.bncf.firenze.sbn.it/termine.php
notation: 019.001
in scheme: subject-disciplines
has rank order: 2