storia moderna
type: Concept
has rank order: 2
related match: http://thes.bncf.firenze.sbn.it/termine.php
editorial note: Fonte: Decreto Ministeriale 4 ottobre 2000 [In rete] http://attiministeriali.miur.it/anno-2000/ottobre/dm-04102000.aspx (26 febbraio 2018)
in scheme: subject-disciplines
preferred label: modern history @en
broader: https://w3id.org/italia/controlled-vocabulary/classifications-for-culture/subject-disciplines/019
notation: 019.002
definition: Il settore comprende competenze e ambiti relativi all'arco cronologico che va dal superamento del mondo medievale al compiuto realizzarsi della moderna società industriale e di massa, periodo in cui si affermano la riscoperta dei valori classici, il diritto alla tolleranza politica e religiosa, la costruzione dello stato moderno e la formulazione dei diritti del cittadino e dei popoli. Presenta caratteristiche interdisciplinari – la storia politico-istituzionale si coniuga con quella economico-sociale, religiosa, culturale, militare e di genere - e comprende altresì le competenze relative alla metodologia, alla storiografia e alla didattica del settore.