storia dell'europa orientale
type: Concept
broader: https://w3id.org/italia/controlled-vocabulary/classifications-for-culture/subject-disciplines/019
notation: 019.003
editorial note: Fonte: Decreto Ministeriale 4 ottobre 2000 [In rete] http://attiministeriali.miur.it/anno-2000/ottobre/dm-04102000.aspx (26 febbraio 2018)
has rank order: 2
definition: Il settore si caratterizza per la specificità geografica e storico-culturale fortemente connotata dalle culture bizantina, slava e ottomana e dalla relativa estraneità dell'area ad alcuni fenomeni che hanno segnato la nascita e lo sviluppo dell'Europa occidentale (l'accumulazione primitiva del capitale, la rivoluzione francese, la formazione dello stato moderno). Comprende anche le competenze relative allo studio storico dei fenomeni politico-istituzionali, economico-sociali, religiosi, culturali e linguistici dell'area considerata in età moderna e contemporanea.
preferred label: history of eastern europe @en
in scheme: subject-disciplines