storia della scienza e delle tecniche
type: Concept
broader: 019
definition: Il settore comprende le ricerche che si propongono, in un arco temporale che va dall'antichità classica ai giorni nostri, la ricostruzione storica e critica dello sviluppo della scienza, delle tecniche e delle istituzioni scientifiche e tecniche, anche in relazione al contesto filosofico-culturale ed economico-sociale. Gli studi compresi nel settore riguardano principalmente l'evolversi delle conoscenze sulla natura e sull'uomo, sia in generale sia nei diversi ambiti scientifici.
editorial note: Fonte: Decreto Ministeriale 4 ottobre 2000 [In rete] http://attiministeriali.miur.it/anno-2000/ottobre/dm-04102000.aspx (26 febbraio 2018)
in scheme: subject-disciplines
notation: 019.005
preferred label: history of science and technology @en
has rank order: 2