storia delle religioni
type: Concept
broader: https://w3id.org/italia/controlled-vocabulary/classifications-for-culture/subject-disciplines/019
notation: 019.006
editorial note: Fonte: Decreto Ministeriale 4 ottobre 2000 [In rete] http://attiministeriali.miur.it/anno-2000/ottobre/dm-04102000.aspx (26 febbraio 2018)
has rank order: 2
definition: Il settore comprende le competenze incentrate intorno alla storia delle religioni come spazio generale di tipo comparativo. In linea con la tradizione italiana, queste rispecchiano anche gli ambiti di ricerca e di insegnamento di maggiore interesse documentario a partire dai quali viene praticata la comparazione storico-religiosa: antropologia, mondo classico, Vicino Oriente, mondo biblico, ebraismo, tradizione cristiana con particolare attenzione all'Oriente cristiano.
preferred label: history of religions @en
in scheme: subject-disciplines