archivistica, bibliografia e biblioteconomia
type: Concept
alternative label: biblioteconomia
alternative label: archivistica
alternative label: bibliografia
broader: 019
definition: Le competenze del subsettore archivistica riguardano sia lo studio della tradizione e dell'ordinamento dei materiali d'archivio sia lo studio degli archivi come strutture di ordinamento e conservazione del materiale tramandato, con particolare attenzione alle norme relative alla selezione, allo scarto e alle applicazioni delle tecniche di registrazione del materiale documentario. Considerano un arco cronologico che va dal tardo medioevo all'età contemporanea, con il suo fulcro nell'età moderna in cui si consolidano le tecniche e le grandi strutture della conservazione documentaria. Le competenze del subsettore bibliografia e biblioteconomia riguardano la storia della tradizione dei testi scritti, elaborati o tramandati su qualunque supporto, del loro ordinamento e messa in uso; riguardano altresì la realtà semantica dei documenti e lo studio della progettazione, fabbricazione, diffusione, informazione, conservazione libraria intesa come elemento costituente la storia della cultura. Il settore ha una caratterizzazione scientifica e teorica riscontrabile anche nella peculiarità metodologica di ricerche che tengono conto del triplice livello degli oggetti di studio: la realtà fisica dei documenti, quella letteraria (testuale, autorale, editoriale) e quella concettuale ricorrendo a una logica propria, servendosi tra l'altro dei linguaggi e delle tecniche informatiche.
editorial note: Fonte: Decreto Ministeriale 4 ottobre 2000 [In rete] http://attiministeriali.miur.it/anno-2000/ottobre/dm-04102000.aspx (26 febbraio 2018)
in scheme: subject-disciplines
notation: 019.007
preferred label: archival science, bibliography and librarianship @en
related match: http://thes.bncf.firenze.sbn.it/termine.php
related match: biblioteconomia e archivistica
has rank order: 2