paleografia
type: Concept
preferred label: paleography @en
broader: https://w3id.org/italia/controlled-vocabulary/classifications-for-culture/subject-disciplines/019
definition: Il settore raggruppa le competenze strettamente correlate tra loro che derivano dall'antica denominazione disciplinare: Paleografia e Diplomatica. Considerano le testimonianze grafiche del mondo classico greco e latino e medievale con particolare riferimento agli ambiti filologici e storici e all'esegesi storico giuridica dei documenti.
notation: 019.009
related match: http://thes.bncf.firenze.sbn.it/termine.php
editorial note: Fonte: Decreto Ministeriale 4 ottobre 2000 [In rete] http://attiministeriali.miur.it/anno-2000/ottobre/dm-04102000.aspx (26 febbraio 2018)
in scheme: subject-disciplines
has rank order: 2