discipline demoetnoantropologiche
type: Concept
broader: https://w3id.org/italia/controlled-vocabulary/classifications-for-culture/subject-disciplines/019
notation: 019.010
editorial note: Fonte: Decreto Ministeriale 4 ottobre 2000 [In rete] http://attiministeriali.miur.it/anno-2000/ottobre/dm-04102000.aspx (26 febbraio 2018)
has rank order: 2
definition: Il settore comprende gli studi relativi alla cultura e alle culture, cioè al complesso delle concezioni e dei comportamenti dell'uomo nelle società. Attraverso metodologie basate fondamentalmente sull'osservazione e il rapporto diretto, vengono studiati i meccanismi generali dei processi culturali e le modalità con cui le culture si configurano e si diversificano, per cogliere comparativamente sia le differenze sia le identità soggiacenti nelle diverse popolazioni. Il settore presenta tre distinti ambiti di ricerca: le antropologie articolano l’oggetto di studio secondo tematizzazioni connesse ai vari campi dell’esperienza umana; le etnologie secondo le aree territoriali (civiltà); le demologie secondo criteri a un tempo tematici e areali in riferimento alle culture delle classi subalterne delle società occidentali. Comprende altresì le competenze relative alla metodologia e alla storia delle ricerche nel settore.
preferred label: demology, ethnology and anthropology @en
in scheme: subject-disciplines