geografia
type: Concept
notation: 019.011
has rank order: 2
in scheme: subject-disciplines
preferred label: geography @en
definition: Il settore comprende competenze relative ai processi attraverso cui le società umane connettono gli ambienti e le risorse esistenti sulla superficie terrestre integrandole nelle proprie trasformazioni. A partire dalle conoscenze sulla natura del territorio e sui processi evolutivi e trasformativi che lo concernono vengono raffigurate, con il supporto della Cartografia, le forme e i contenuti della superficie terrestre rappresentando l'insieme degli insediamenti che vi sono contenuti. Il settore è caratterizzato da integrazioni interdisciplinari con l'analisi e l'organizzazione territoriale delle componenti ambientali, storiche e culturali.
related match: http://thes.bncf.firenze.sbn.it/termine.php
editorial note: Fonte: Decreto Ministeriale 4 ottobre 2000 [In rete] http://attiministeriali.miur.it/anno-2000/ottobre/dm-04102000.aspx (26 febbraio 2018)
broader: https://w3id.org/italia/controlled-vocabulary/classifications-for-culture/subject-disciplines/019