geografia economico-politica
type: Concept
definition: Il settore comprende competenze relative all'analisi dei fenomeni economici e degli assetti politico-amministrativi riferiti sia al substrato fisico e ambientale, sia alla struttura della popolazione e dell'insediamento. Le ricerche hanno valenze teoriche e applicative aperte alla pianificazione e alla programmazione dello sviluppo sostenibile con evidente interdisciplinarità per quanto riguarda lo studio delle risorse, l'utilizzazione dello spazio, la localizzazione industriale e terziaria, l'innovazione, nonché i riflessi sul sistema urbano e regionale facendo riferimento alle diverse scale territoriali. Supporto strumentale permane la cartografia, in particolare tematica, integrata con la costruzione di sistemi informativi geografici. I campi di approfondimento comprendono le diverse modalità dell’interazione uomo-ambiente in termini di riflessi territoriali delle politiche generali e settoriali, la regionalizzazione geografica, la distribuzione degli insediamenti, la geografia dei settori produttivi, l’assetto reticolare delle relazioni immateriali concernenti la produzione, la distribuzione dei beni e delle risorse, la diffusione spaziale dell’innovazione.
editorial note: Fonte: Decreto Ministeriale 4 ottobre 2000 [In rete] http://attiministeriali.miur.it/anno-2000/ottobre/dm-04102000.aspx (26 febbraio 2018)
preferred label: economic and political geography @en
notation: 019.012
in scheme: subject-disciplines
broader: https://w3id.org/italia/controlled-vocabulary/classifications-for-culture/subject-disciplines/019
related match: http://thes.bncf.firenze.sbn.it/termine.php
has rank order: 2