logica e filosofia della scienza
type: Concept
alternative label: logica
alternative label: filosofia della scienza
broader: 020
definition: Le ricerche del settore si occupano sul piano teorico e su quello storico delle organiche connessioni esistenti tra ricerca filosofica e conoscenza scientifica, della logica con i suoi metodi specifici, della struttura logica dei linguaggi naturali, della computazione e della comunicazione, dell’epistemologia e della rappresentazione delle conoscenze, delle questioni metodologiche e fondative proprie delle singole scienze in stretta relazione con il loro sviluppo.
editorial note: Fonte: Decreto Ministeriale 4 ottobre 2000 [In rete] http://attiministeriali.miur.it/anno-2000/ottobre/dm-04102000.aspx (26 febbraio 2018)
in scheme: subject-disciplines
notation: 020.002
preferred label: logic and philosophy of science @en
related match: logica
related match: filosofia della scienza
related match: http://thes.bncf.firenze.sbn.it/termine.php
has rank order: 2