filosofia morale
type: Concept
broader: 020
definition: Il settore comprende le competenze relative allo studio dell'agire dell'uomo nella sua dimensione morale, etico-sociale, politica, dell'etica della comunicazione e della filosofia politica. Comprende le elaborazioni sul rapporto uomo-ambiente e riflette sulle conseguenze etiche che derivano dallo sviluppo delle scienze. Le ricerche del settore sono condotte con prospettive di carattere fondativo e/o storico.
editorial note: Fonte: Decreto Ministeriale 4 ottobre 2000 [In rete] http://attiministeriali.miur.it/anno-2000/ottobre/dm-04102000.aspx (26 febbraio 2018)
in scheme: subject-disciplines
notation: 020.004
preferred label: moral philosophy @en
has rank order: 2