estetica
type: Concept
editorial note: Fonte: Decreto Ministeriale 4 ottobre 2000 [In rete] http://attiministeriali.miur.it/anno-2000/ottobre/dm-04102000.aspx (26 febbraio 2018)
related match: http://thes.bncf.firenze.sbn.it/termine.php
definition: Il settore accorpa e articola le competenze che intrecciano riflessione filosofica e pratiche delle arti, saperi delle differenti tradizioni artistiche e loro riformulazioni epistemiche, considerandoli dal punto di vista ermeneutico, storico filosofico, semiotico, retorico e stilistico.
has rank order: 2
in scheme: subject-disciplines
notation: 020.005
preferred label: aesthetics @en
related match: estetica
broader: https://w3id.org/italia/controlled-vocabulary/classifications-for-culture/subject-disciplines/020