filosofia e teoria dei linguaggi
type: Concept
alternative label: teoria dei linguaggi
alternative label: filosofia del linguaggio
broader: 020
definition: Il settore raccoglie un insieme di competenze che considerano il linguaggio come oggetto di indagine eminentemente teorica; riflettono sulle diverse modalità e articolazioni che l'indagine sul linguaggio può assumere; affrontano il ruolo che la dimensione linguistica riveste nel contesto di altri ambiti significativi dell'esperienza umana; indagano sulle articolazioni storiche della riflessione filosofica sul linguaggio e della sua dimensione semeiotica.
editorial note: Fonte: Decreto Ministeriale 4 ottobre 2000 [In rete] http://attiministeriali.miur.it/anno-2000/ottobre/dm-04102000.aspx (26 febbraio 2018)
in scheme: subject-disciplines
notation: 020.006
preferred label: philosophy and theory of language @en
related match: filosofia del linguaggio
related match: http://thes.bncf.firenze.sbn.it/termine.php
has rank order: 2