storia della filosofia
type: Concept
broader: 020
definition: Il settore comprende le competenze che studiano la filosofia nella sua genesi e sviluppo storico, individuandone teorie, proposizioni e risultati in contesti socio-culturali definiti cronologicamente o individuati in rapporto a specifici orientamenti teorici. Comprende inoltre le indagini di carattere storiografico che si pongono come autoriflessione critica sulle metodologie delle indagini storiche.
editorial note: Fonte: Decreto Ministeriale 4 ottobre 2000 [In rete] http://attiministeriali.miur.it/anno-2000/ottobre/dm-04102000.aspx (26 febbraio 2018)
in scheme: subject-disciplines
notation: 020.007
preferred label: history of philosophy @en
related match: storia della filosofia
has rank order: 2