storia della filosofia antica
type: Concept
broader: https://w3id.org/italia/controlled-vocabulary/classifications-for-culture/subject-disciplines/020
notation: 020.008
editorial note: Fonte: Decreto Ministeriale 4 ottobre 2000 [In rete] http://attiministeriali.miur.it/anno-2000/ottobre/dm-04102000.aspx (26 febbraio 2018)
has rank order: 2
definition: Il settore comprende le ricerche che si occupano della filosofia nella sua genesi e sviluppo processuale, dei rapporti della filosofia con i saperi del tempo, individuandone teorie, proposizioni e risultati nel contesto socio-culturale definito cronologicamente in un arco temporale che va dal VI sec. a.C. al VI sec. d.C. Si occupa inoltre della riflessione critica sul metodo e della storiografia filosofica antica.
preferred label: history of ancient philosophy @en
in scheme: subject-disciplines