storia della filosofia medievale
type: Concept
broader: https://w3id.org/italia/controlled-vocabulary/classifications-for-culture/subject-disciplines/020
notation: 020.009
editorial note: Fonte: Decreto Ministeriale 4 ottobre 2000 [In rete] http://attiministeriali.miur.it/anno-2000/ottobre/dm-04102000.aspx (26 febbraio 2018)
has rank order: 2
definition: Il settore comprende le competenze che studiano la filosofia nella sua genesi e sviluppo processuale, individuandone teorie, proposizioni e risultati nel contesto socio-culturale definito cronologicamente dal tardo antico (VI secolo d. C) sino alle soglie dell'età moderna (XV secolo d.C.). Si occupa inoltre della riflessione critica sul metodo e della storiografia filosofica medievale, compresi gli ambiti della filosofia islamica ed ebraica.
preferred label: history of medieval philosophy @en
in scheme: subject-disciplines