pedagogia generale e sociale
type: Concept
broader: https://w3id.org/italia/controlled-vocabulary/classifications-for-culture/subject-disciplines/021
notation: 021.001
preferred label: theories and science of education and social education @en
definition: Il settore include due ambiti di ricerca differenziabili per l'immediatezza delle implicazioni applicative. Il primo comprende l'area delle ricerche pedagogiche di carattere teoretico-fondativo ed epistemologico-metodologico; in particolare raccoglie le competenze che hanno una tradizione trattatistica e speculativa e che pongono le basi teoriche e procedurali per le competenze pedagogiche. Il secondo ambito di ricerca è caratterizzato dall'attenzione per i bisogni educativi e formativi nella società e nelle organizzazioni e dalle ricerche sulle attività educative connesse ai cambiamenti culturali e degli stili di vita e sulle implicazioni educative dei nuovi fenomeni sociali e interculturali. Comprende altresì l'educazione permanente e degli adulti.
has rank order: 2
in scheme: subject-disciplines
related match: http://thes.bncf.firenze.sbn.it/termine.php
editorial note: Fonte: Decreto Ministeriale 4 ottobre 2000 [In rete] http://attiministeriali.miur.it/anno-2000/ottobre/dm-04102000.aspx (26 febbraio 2018)