storia della pedagogia
type: Concept
broader: https://w3id.org/italia/controlled-vocabulary/classifications-for-culture/subject-disciplines/021
notation: 021.002
editorial note: Fonte: Decreto Ministeriale 4 ottobre 2000 [In rete] http://attiministeriali.miur.it/anno-2000/ottobre/dm-04102000.aspx (26 febbraio 2018)
has rank order: 2
definition: Gli studi nel settore riguardano la ricostruzione dello sviluppo storico della riflessione e della ricerca pedagogica, lo sviluppo della scuola, delle istituzioni e delle pratiche educative viste nel contesto socio-culturale di appartenenza nonché la storia e la letteratura per l'infanzia.
preferred label: history of education @en
in scheme: subject-disciplines