pedagogia sperimentale
type: Concept
in scheme: subject-disciplines
definition: Il settore comprende le ricerche a carattere applicativo ed empirico, con impostazione sperimentale, relative alla valutazione delle competenze e dei rendimenti scolastici e dei processi di formazione, nonché quelle relative alla progettazione e alla valutazione delle tecnologie e tecniche educative e degli interventi nei sistemi scolastici. Comprende altresì le competenze metodologiche necessarie alla ricerca didattica e docimologica.
has rank order: 2
editorial note: Fonte: Decreto Ministeriale 4 ottobre 2000 [In rete] http://attiministeriali.miur.it/anno-2000/ottobre/dm-04102000.aspx (26 febbraio 2018)
notation: 021.004
related match: http://thes.bncf.firenze.sbn.it/termine.php
broader: https://w3id.org/italia/controlled-vocabulary/classifications-for-culture/subject-disciplines/021
preferred label: educational research @en