psicobiologia e psicologia fisiologica
type: Concept
preferred label: psychobiology and physiological psychology @en
alternative label: psicologia fisiologica
editorial note: Fonte: Decreto Ministeriale 4 ottobre 2000 [In rete] http://attiministeriali.miur.it/anno-2000/ottobre/dm-04102000.aspx (26 febbraio 2018)
alternative label: psicobiologia
notation: 022.002
related match: http://thes.bncf.firenze.sbn.it/termine.php
has rank order: 2
in scheme: subject-disciplines
definition: Il settore raggruppa le competenze scientifico disciplinari concernenti lo studio dei fondamenti e dei correlati biologici e fisiologici del comportamento e delle funzioni percettive, cognitive ed emotive, nell'uomo e negli animali, di più immediato interesse psicologico, anche in relazione alle attività motorie e sportive. In generale, comprende le competenze scientifico disciplinari concernenti i rapporti tra strutture nervose e attività psichica. Comprende anche le competenze scientifico disciplinari relative ai metodi e alle tecniche di studio caratteristici degli studi del settore.
broader: https://w3id.org/italia/controlled-vocabulary/classifications-for-culture/subject-disciplines/022