psicometria
type: Concept
preferred label: psychometrics @en
has rank order: 2
broader: https://w3id.org/italia/controlled-vocabulary/classifications-for-culture/subject-disciplines/022
definition: Il settore comprende le competenze scientifico disciplinari specificamente riferite alla misura in psicologia, alla teoria dei test psicologici e alle applicazioni della matematica e della statistica alla psicologia.
notation: 022.003
editorial note: Fonte: Decreto Ministeriale 4 ottobre 2000 [In rete] http://attiministeriali.miur.it/anno-2000/ottobre/dm-04102000.aspx (26 febbraio 2018)
in scheme: subject-disciplines
related match: http://thes.bncf.firenze.sbn.it/termine.php