psicometria
type: Concept
broader: 022
definition: Il settore comprende le competenze scientifico disciplinari specificamente riferite alla misura in psicologia, alla teoria dei test psicologici e alle applicazioni della matematica e della statistica alla psicologia.
editorial note: Fonte: Decreto Ministeriale 4 ottobre 2000 [In rete] http://attiministeriali.miur.it/anno-2000/ottobre/dm-04102000.aspx (26 febbraio 2018)
in scheme: subject-disciplines
notation: 022.003
preferred label: psychometrics @en
related match: http://thes.bncf.firenze.sbn.it/termine.php
has rank order: 2