psicologia dello sviluppo e psicologia dell'educazione
type: Concept
alternative label: psicologia dello sviluppo
alternative label: psicologia dell'educazione
broader: 022
definition: Comprende le competenze scientifico disciplinari concernenti lo studio dei comportamenti e delle principali funzioni psicologiche in una prospettiva ontogenetica che ricopre non solo il periodo dello sviluppo ma l'intero arco della vita; nonché le competenze scientifico disciplinari relative ai metodi e alle tecniche che caratterizzano detti ambiti di studio. Comprende altresì le competenze scientifico disciplinari relative allo studio e alle applicazioni delle conoscenze sui processi psicologici più specificamente implicati nel campo dell'educazione e dell'orientamento scolastico e professionale.
editorial note: Fonte: Decreto Ministeriale 4 ottobre 2000 [In rete] http://attiministeriali.miur.it/anno-2000/ottobre/dm-04102000.aspx (26 febbraio 2018)
in scheme: subject-disciplines
notation: 022.004
preferred label: developmental and educational psychology @en
related match: http://thes.bncf.firenze.sbn.it/termine.php
has rank order: 2