psicologia sociale
type: Concept
has rank order: 2
related match: http://thes.bncf.firenze.sbn.it/termine.php
definition: Il settore raggruppa le competenze scientifico disciplinari relative alla comprensione delle relazioni tra processi ed eventi collettivi e societari (ambientali, culturali, comunitari, familiari, politici, economici, giuridici) e processi psicologici sociali, individuali e di gruppo (disposizioni, atteggiamenti, comunicazione, interazione, ecc.) che influenzano il funzionamento dei sistemi e sotto-sistemi sociali e da cui sono a loro volta influenzati. Comprende altresì le competenze scientifico disciplinari relative ai metodi e alle tecniche che caratterizzano tale studi.
editorial note: Fonte: Decreto Ministeriale 4 ottobre 2000 [In rete] http://attiministeriali.miur.it/anno-2000/ottobre/dm-04102000.aspx (26 febbraio 2018)
in scheme: subject-disciplines
preferred label: social psychology @en
notation: 022.005
broader: https://w3id.org/italia/controlled-vocabulary/classifications-for-culture/subject-disciplines/022