psicologia dinamica
type: Concept
notation: 022.007
preferred label: dynamic psychology @en
editorial note: Fonte: Decreto Ministeriale 4 ottobre 2000 [In rete] http://attiministeriali.miur.it/anno-2000/ottobre/dm-04102000.aspx (26 febbraio 2018)
in scheme: subject-disciplines
has rank order: 2
broader: https://w3id.org/italia/controlled-vocabulary/classifications-for-culture/subject-disciplines/022
definition: Comprende le competenze scientifico disciplinari che considerano da un punto di vista psicodinamico e psicogenetico le rappresentazioni del sé, i processi intrapsichici e le relazioni interpersonali (familiari e di gruppo), nonché le competenze relative alle applicazioni di tali conoscenze alla analisi e al trattamento del disagio psichico e delle psicopatologie. Comprende altresì le competenze scientifico disciplinari relative ai metodi e alle tecniche che caratterizzano gli studi in quest'ambito disciplinare.
related match: http://thes.bncf.firenze.sbn.it/termine.php