psicologia clinica
type: Concept
broader: https://w3id.org/italia/controlled-vocabulary/classifications-for-culture/subject-disciplines/022
preferred label: clinical psychology @en
notation: 022.008
related match: http://thes.bncf.firenze.sbn.it/termine.php
editorial note: Fonte: Decreto Ministeriale 4 ottobre 2000 [In rete] http://attiministeriali.miur.it/anno-2000/ottobre/dm-04102000.aspx (26 febbraio 2018)
definition: Il settore comprende le competenze relative ai metodi di studio e alle tecniche di intervento che, nei diversi modelli operativi (individuale, relazionale, familiare e di gruppo), caratterizzano le applicazioni cliniche della psicologia a differenti ambiti (persone, gruppi, sistemi) per la soluzione dei loro problemi. Nei campi della salute e sanitario, del disagio psicologico, degli aspetti psicologici delle psicopatologie (psicosomatiche, sessuologiche, tossicomaniche incluse), dette competenze, estese alla psicofisiologia e alla neuropsicologia clinica, sono volte all'analisi e alla soluzione di problemi tramite interventi di valutazione, prevenzione, riabilitazione psicologica e psicoterapia.
has rank order: 2
in scheme: subject-disciplines