diritto privato
type: Concept
definition: Il settore comprende gli studi relativi al sistema del diritto privato quale emerge dalla normativa del codice civile e dalle leggi ad esso complementari. Gli studi attengono, altresì, al diritto civile, ai diritti delle persone, della famiglia, al diritto dell’informatica, ai profili privatistici del diritto dell’informazione e della comunicazione e al biodiritto.
notation: 023.001
in scheme: subject-disciplines
related match: http://thes.bncf.firenze.sbn.it/termine.php
has rank order: 2
preferred label: private law @en
broader: https://w3id.org/italia/controlled-vocabulary/classifications-for-culture/subject-disciplines/023
editorial note: Fonte: Decreto Ministeriale 4 ottobre 2000 [In rete] http://attiministeriali.miur.it/anno-2000/ottobre/dm-04102000.aspx (26 febbraio 2018)