diritto privato comparato
type: Concept
broader: https://w3id.org/italia/controlled-vocabulary/classifications-for-culture/subject-disciplines/023
editorial note: Fonte: Decreto Ministeriale 4 ottobre 2000 [In rete] http://attiministeriali.miur.it/anno-2000/ottobre/dm-04102000.aspx (26 febbraio 2018)
notation: 023.002
preferred label: comparative private law @en
has rank order: 2
definition: Il settore comprende gli studi relativi all'identificazione dei sistemi giuridici, alla loro classificazione e all'inquadramento dei singoli ordinamenti nell'uno o nell'altro sistema. Gli studi attengono, altresì, alle analisi comparative di istituti, regole e tecniche riconducibili al diritto privato ed appartenenti a ordinamenti giuridici diversi, nonché le ricerche riguardanti l'unificazione del diritto ed il suo impatto sugli ordinamenti interni.
in scheme: subject-disciplines
related match: http://thes.bncf.firenze.sbn.it/termine.php