diritto agrario
type: Concept
preferred label: agri-food law @en
related match: http://thes.bncf.firenze.sbn.it/termine.php
definition: Il settore comprende gli studi relativi all'organizzazione ed allo svolgimento dell'attività produttiva agricola nei suoi molteplici aspetti giuridici, quale individuata dalla disciplina del codice civile, dalla legislazione speciale e dalla normativa comunitaria, con attenzione anche ai profili di diritto comparato. Gli studi attengono, altresì, alle problematiche giuridiche relative alla tutela dell'ambiente ed alla commercializzazione dei prodotti agricoli.
in scheme: subject-disciplines
notation: 023.003
has rank order: 2
broader: https://w3id.org/italia/controlled-vocabulary/classifications-for-culture/subject-disciplines/023
editorial note: Fonte: Decreto Ministeriale 4 ottobre 2000 [In rete] http://attiministeriali.miur.it/anno-2000/ottobre/dm-04102000.aspx (26 febbraio 2018)