diritto dell'economia
type: Concept
broader: https://w3id.org/italia/controlled-vocabulary/classifications-for-culture/subject-disciplines/023
notation: 023.005
editorial note: Fonte: Decreto Ministeriale 4 ottobre 2000 [In rete] http://attiministeriali.miur.it/anno-2000/ottobre/dm-04102000.aspx (26 febbraio 2018)
has rank order: 2
definition: Il settore comprende gli studi relativi alla regolamentazione delle attività economiche, volti ad approfondirne i profili pubblicistici e privatistici secondo un metodo interdisciplinare. Gli studi attengono, in particolare, agli ordinamenti settoriali dell'attività bancaria, finanziaria ed assicurativa.
preferred label: economics law @en
in scheme: subject-disciplines