diritto della navigazione
type: Concept
related match: http://thes.bncf.firenze.sbn.it/termine.php
preferred label: navigation and air law @en
notation: 023.006
editorial note: Fonte: Decreto Ministeriale 4 ottobre 2000 [In rete] http://attiministeriali.miur.it/anno-2000/ottobre/dm-04102000.aspx (26 febbraio 2018)
broader: https://w3id.org/italia/controlled-vocabulary/classifications-for-culture/subject-disciplines/023
has rank order: 2
in scheme: subject-disciplines
definition: Il settore comprende gli studi relativi all'ordinamento speciale ed autonomo della navigazione marittima, interna ed aerea, nei suoi aspetti di diritto pubblico e privato, comunitario ed internazionale, processuale e penale, al diritto dei trasporti ed al diritto aerospaziale.