diritto del lavoro
type: Concept
broader: https://w3id.org/italia/controlled-vocabulary/classifications-for-culture/subject-disciplines/023
editorial note: Fonte: Decreto Ministeriale 4 ottobre 2000 [In rete] http://attiministeriali.miur.it/anno-2000/ottobre/dm-04102000.aspx (26 febbraio 2018)
notation: 023.007
has rank order: 2
related match: http://thes.bncf.firenze.sbn.it/termine.php
definition: Il settore comprende gli studi relativi alla disciplina dei rapporti individuali e collettivi di lavoro, al diritto sindacale e delle relazioni industriali, al diritto previdenziale e della sicurezza sociale in genere, con riferimento, altresì, all'organizzazione amministrativa. Gli studi attengono, altresì, alla legislazione delle pari opportunità.
in scheme: subject-disciplines
preferred label: labour law @en