diritto costituzionale
type: Concept
in scheme: subject-disciplines
has rank order: 2
broader: https://w3id.org/italia/controlled-vocabulary/classifications-for-culture/subject-disciplines/023
definition: Il settore comprende gli studi relativi all'organizzazione fondamentale dell’ordinamento, quale risulta dalla Carta costituzionale, con specifico riferimento alla formazione, alla composizione, ai poteri ed alle interazioni degli organi costituzionali. Gli studi attengono, altresì, al diritto parlamentare, alla giustizia costituzionale, all'ordinamento regionale, nonché ai principi fondamentali che governano i diritti di libertà individuali e collettivi.
editorial note: Fonte: Decreto Ministeriale 4 ottobre 2000 [In rete] http://attiministeriali.miur.it/anno-2000/ottobre/dm-04102000.aspx (26 febbraio 2018)
related match: http://thes.bncf.firenze.sbn.it/termine.php
preferred label: constitutional law @en
notation: 023.008