istituzioni di diritto pubblico
type: Concept
related match: http://thes.bncf.firenze.sbn.it/termine.php
preferred label: public law @en
editorial note: Fonte: Decreto Ministeriale 4 ottobre 2000 [In rete] http://attiministeriali.miur.it/anno-2000/ottobre/dm-04102000.aspx (26 febbraio 2018)
has rank order: 2
broader: https://w3id.org/italia/controlled-vocabulary/classifications-for-culture/subject-disciplines/023
notation: 023.009
definition: Il settore comprende gli studi relativi alla configurazione giuridica dello Stato, tanto nella prospettiva diacronica che in quella sincronica. Gli studi mirano a fornire conoscenze di base relative al sistema delle fonti normative, all'organizzazione costituzionale ed amministrativa dello Stato e degli enti pubblici, ai diritti dei cittadini, nonché all'ordinamento giudiziario.
alternative label: diritto pubblico
in scheme: subject-disciplines