diritto amministrativo
type: Concept
has rank order: 2
related match: http://thes.bncf.firenze.sbn.it/termine.php
broader: https://w3id.org/italia/controlled-vocabulary/classifications-for-culture/subject-disciplines/023
in scheme: subject-disciplines
editorial note: Fonte: Decreto Ministeriale 4 ottobre 2000 [In rete] http://attiministeriali.miur.it/anno-2000/ottobre/dm-04102000.aspx (26 febbraio 2018)
definition: Il settore comprende gli studi relativi all'organizzazione della pubblica amministrazione ed alla disciplina dell’attività amministrativa pubblica, con riferimento, in particolare, al procedimento, agli atti, al controllo giurisdizionale ai profili finanziari. Gli studi attengono, altresì, al diritto regionale e degli enti locali, alla contabilità dello Stato e degli enti pubblici, al diritto urbanistico, nonché ai profili pubblicistici del diritto dell’ambiente e del diritto dell'informazione e della comunicazione.
notation: 023.010
preferred label: administrative law @en