diritto canonico e diritto ecclesiastico
type: Concept
definition: Il settore comprende gli studi relativi alla disciplina giuridica del fenomeno religioso, anche nella prospettiva comparatistica, sia all’interno dell’ordinamento statuale, sia negli ordinamenti confessionali, con particolare riferimento a quello della Chiesa cattolica. Gli studi attengono, altresì, alla storia del diritto canonico, alla storia e sistemi dei rapporti tra Stato e Chiesa, al diritto comparato delle religioni e si estendono ai profili di rilevanza giuridica dei fenomeni di pluralismo etico e religioso.
broader: https://w3id.org/italia/controlled-vocabulary/classifications-for-culture/subject-disciplines/023
in scheme: subject-disciplines
preferred label: ecclesiastical and canon law @en
related match: http://thes.bncf.firenze.sbn.it/termine.php
alternative label: diritto ecclesiastico
alternative label: diritto canonico
notation: 023.011
editorial note: Fonte: Decreto Ministeriale 4 ottobre 2000 [In rete] http://attiministeriali.miur.it/anno-2000/ottobre/dm-04102000.aspx (26 febbraio 2018)
has rank order: 2