diritto tributario
type: Concept
has rank order: 2
in scheme: subject-disciplines
notation: 023.012
broader: https://w3id.org/italia/controlled-vocabulary/classifications-for-culture/subject-disciplines/023
related match: http://thes.bncf.firenze.sbn.it/termine.php
preferred label: tax law @en
editorial note: Fonte: Decreto Ministeriale 4 ottobre 2000 [In rete] http://attiministeriali.miur.it/anno-2000/ottobre/dm-04102000.aspx (26 febbraio 2018)
definition: Il settore comprende gli studi relativi all'amministrazione finanziaria dello Stato, delle Regioni e degli enti pubblici territoriali, con particolare riferimento al regime dell’imposizione tributaria, nonché quelli relativi agli aspetti sanzionatori, processuali, comunitari, internazionali e comparatistici della materia.