diritto internazionale
type: Concept
definition: Il settore comprende gli studi relativi ai rapporti tra Stati, con riferimento ai caratteri strutturali dell'ordinamento internazionale, agli ambiti normativi in cui esso si articola, all'adattamento del diritto interno, alle organizzazioni internazionali, incluse le forme giuridiche della cooperazione europea, alla tutela dei diritti umani. Gli studi attengono, altresì, al diritto internazionale privato e processuale con particolare riferimento anche a profili istituzionali dell’Unione europea.
notation: 023.013
in scheme: subject-disciplines
preferred label: international law @en
broader: https://w3id.org/italia/controlled-vocabulary/classifications-for-culture/subject-disciplines/023
has rank order: 2
editorial note: Fonte: Decreto Ministeriale 4 ottobre 2000 [In rete] http://attiministeriali.miur.it/anno-2000/ottobre/dm-04102000.aspx (26 febbraio 2018)
related match: http://thes.bncf.firenze.sbn.it/termine.php