diritto processuale civile
type: Concept
notation: 023.015
definition: Il settore comprende gli studi relativi alla disciplina del fenomeno processuale nell’ambito civilistico (dal procedimento di cognizione al procedimento di esecuzione), al diritto processuale del lavoro, al diritto dell’arbitrato ed al diritto fallimentare (con particolare riferimento agli aspetti processuali), all’ordinamento giudiziario, nonché gli studi relativi alle dottrine generali del processo per quanto attiene al versante civilistico.
in scheme: subject-disciplines
preferred label: civil procedural law @en
has rank order: 2
broader: https://w3id.org/italia/controlled-vocabulary/classifications-for-culture/subject-disciplines/023
editorial note: Fonte: Decreto Ministeriale 4 ottobre 2000 [In rete] http://attiministeriali.miur.it/anno-2000/ottobre/dm-04102000.aspx (26 febbraio 2018)
related match: http://thes.bncf.firenze.sbn.it/termine.php