diritto processuale penale
type: Concept
in scheme: subject-disciplines
preferred label: criminal procedure @en
definition: Il settore comprende gli studi relativi alla disciplina del fenomeno processuale nell'ambito penalistico (dal procedimento di cognizione al procedimento di esecuzione), al diritto processuale penale militare, al diritto penitenziario ed alla giustizia penale minorile, nonché gli studi relativi alle dottrine generali del processo per quanto attiene al versante penalistico.
broader: https://w3id.org/italia/controlled-vocabulary/classifications-for-culture/subject-disciplines/023
editorial note: Fonte: Decreto Ministeriale 4 ottobre 2000 [In rete] http://attiministeriali.miur.it/anno-2000/ottobre/dm-04102000.aspx (26 febbraio 2018)
has rank order: 2
related match: http://thes.bncf.firenze.sbn.it/termine.php
notation: 023.016