diritto penale
type: Concept
broader: https://w3id.org/italia/controlled-vocabulary/classifications-for-culture/subject-disciplines/023
preferred label: criminal law @en
definition: Il settore comprende gli studi relativi alla potestà punitiva dello Stato, con particolare riferimento alla teoria generale del reato e della pena, ai delitti ed alle contravvenzioni previsti dal codice penale e dalla legislazione speciale. Gli studi attengono, altresì, al diritto penale militare, alle diverse articolazioni del diritto penale concernente le attività economiche, alla legislazione penale minorile, nonché alla criminologia per quanto riguarda gli aspetti di più immediata rilevanza giuridica.
in scheme: subject-disciplines
related match: http://thes.bncf.firenze.sbn.it/termine.php
notation: 023.017
editorial note: Fonte: Decreto Ministeriale 4 ottobre 2000 [In rete] http://attiministeriali.miur.it/anno-2000/ottobre/dm-04102000.aspx (26 febbraio 2018)
has rank order: 2