diritto romano e diritti dell'antichità
type: Concept
alternative label: diritti dell'antichità
alternative label: diritto romano
notation: 023.018
definition: Il settore comprende gli studi relativi ai diritti dell’antichità, con particolare riferimento all’esperienza giuridica romana (privatistica e pubblicistica) nel suo svolgimento storico. Lo studio del diritto romano, esegetico e sistematico, condotto con metodi storici e propri del giurista, è finalizzato alla comprensione del patrimonio culturale costituito dalle fonti antiche, le giuridiche in particolare (quelle del Corpus iuris civilis giustinianeo e più in generale giurisprudenziali, ma anche quelle epigrafiche e papirologiche), e dei fondamenti del diritto europeo che discendono dall’esperienza romanistica e dalla sua tradizione culturale e pratica.
broader: https://w3id.org/italia/controlled-vocabulary/classifications-for-culture/subject-disciplines/023
in scheme: subject-disciplines
has rank order: 2
editorial note: Fonte: Decreto Ministeriale 4 ottobre 2000 [In rete] http://attiministeriali.miur.it/anno-2000/ottobre/dm-04102000.aspx (26 febbraio 2018)
related match: http://thes.bncf.firenze.sbn.it/termine.php
preferred label: roman and ancient law @en