storia del diritto medievale e moderno
type: Concept
editorial note: Fonte: Decreto Ministeriale 4 ottobre 2000 [In rete] http://attiministeriali.miur.it/anno-2000/ottobre/dm-04102000.aspx (26 febbraio 2018)
definition: Il settore comprende gli studi relativi alla storia del diritto pubblico, privato, penale, processuale ed internazionale dalla fine del mondo antico all'età contemporanea, con particolare riferimento alle fonti (legislative, dottrinali, documentarie, giurisdizionali), agli istituti, ai giuristi e al metodo giuridico, in un quadro geografico che dall'Italia si estende all'Europa e agli altri continenti.
notation: 023.019
preferred label: history of medieval and modern law @en
has rank order: 2
alternative label: storia del diritto moderno
alternative label: storia del diritto medievale
broader: https://w3id.org/italia/controlled-vocabulary/classifications-for-culture/subject-disciplines/023
in scheme: subject-disciplines