storia del pensiero economico
type: Concept
broader: 024
definition: La storia del pensiero economico si definisce come ambito di ricerca sia con riferimento ai contenuti che alla metodologia adottata. Per quanto riguarda i contenuti, essa ricostruisce lo sviluppo nel tempo delle teorie e delle idee economiche, anche in relazione al contesto scientifico culturale in cui sono state formulate; la trasmissione del sapere economico attraverso l’insegnamento, le pubblicazioni e la partecipazione alle associazioni scientifiche; le interrelazioni tra le teorie e le visioni del sistema economico e i progetti e le realizzazioni di politica economica. Per quanto riguarda il metodo, la ricerca si fonda sulla padronanza degli strumenti analitici, interpretativi e filologici necessari a collocare i problemi e i personaggi studiati nella loro prospettiva storica.
editorial note: Fonte: Decreto Ministeriale 4 ottobre 2000 [In rete] http://attiministeriali.miur.it/anno-2000/ottobre/dm-04102000.aspx (26 febbraio 2018)
in scheme: subject-disciplines
notation: 024.004
preferred label: history of economic thought @en
has rank order: 2