economia e gestione delle imprese
type: Concept
broader: 024
definition: Il settore si occupa, a fini didattici e di ricerca, della gestione e direzione delle aziende di produzione di beni e servizi, sia con riferimento al sistema d'impresa e alle aree funzionali di esso, sia a imprese in tipici settori di attività industriale, commerciale e dei servizi. Particolare evidenza assumono il campo delle decisioni dei dirigenti e delle operazioni aziendali e quello delle relazioni tra sistema d'impresa e sistema competitivo. In posizione di centralità si colloca l'economia e gestione delle imprese, sia negli aspetti istituzionali sia con riferimento a specifici settori e rami di attività. In quest'ambito, assumono fondamentale importanza economia e gestione dell'innovazione, strategie d'impresa, economia e tecnica degli scambi internazionali, marketing, tecniche di gestione degli investimenti e finanziamenti, nonché economia e gestione del settore cooperativo e direzione delle organizzazioni non aventi fine di profitto.
editorial note: Fonte: Decreto Ministeriale 4 ottobre 2000 [In rete] http://attiministeriali.miur.it/anno-2000/ottobre/dm-04102000.aspx (26 febbraio 2018)
in scheme: subject-disciplines
notation: 024.008
preferred label: management @en
has rank order: 2