statistica
type: Concept
broader: 024
definition: Il settore affronta le problematiche relative all’analisi dei dati, al disegno e alla realizzazione di indagini ed esperimenti nei diversi settori applicativi, a fini descrittivi, interpretativi e decisionali. Include quindi gli sviluppi teorici e metodologici propri della statistica descrittiva, esplorativa ed inferenziale nelle loro diverse articolazioni quali statistica matematica, teoria dei campioni, piano degli esperimenti, analisi statistica dei dati multivariati, analisi statistiche delle serie temporali e spaziali; di tali sviluppi sono parte integrante le moderne problematiche relative alla gestione ed elaborazione informatica dei dati.
editorial note: Fonte: Decreto Ministeriale 4 ottobre 2000 [In rete] http://attiministeriali.miur.it/anno-2000/ottobre/dm-04102000.aspx (26 febbraio 2018)
in scheme: subject-disciplines
notation: 024.014
preferred label: statistics @en
related match: statistica
related match: http://thes.bncf.firenze.sbn.it/termine.php
has rank order: 2